Reaction Details
TargetIgA-specific serine endopeptidase autotransporter
LigandBDBM50367757
Substrate/Competitorn/a
Meas. Tech.ChEMBL_88881 (CHEMBL698217)
IC50 1570000±n/a nM
Citation Burton, JWood, SGLynch, MPlaut, AG Substrate analogue inhibitors of the IgA1 proteinases from Neisseria gonorrhoeae. J Med Chem31:1647-51 (1988) IgA-specific serine endopeptidase autotransporter
Name:IgA-specific serine endopeptidase autotransporter
Type:PROTEIN
Mol. Mass.:169014.39
Organism:Neisseria gonorrhoeae
Description:ChEMBL_88881
Residue:1532
BDBM50367757
NameBDBM50367757
Synonyms:CHEMBL2369560
TypeSmall organic molecule
Emp. Form.C36H56N8O14
Mol. Mass.824.875
SMILESC[C@@H](O)[C@H](NC(C)=O)C(=O)N1CCC[C@H]1C(=O)N1CCC[C@H]1C(=O)N[C@@H]([C@H](C)O)C(=O)N1CCC[C@H]1C(=O)N[C@@H](CO)C(=O)N1CCC[C@H]1C(=O)N[C@@H](CO)C(O)=O