Reaction Details
TargetRenin
LigandBDBM50021990
Substrate/Competitorn/a
Meas. Tech.ChEBML_196299
IC50 35000±n/a nM
Citation Hui, KYHoltzman, EJQuinones, MAHollenberg, NKHaber, E Design of rat renin inhibitory peptides. J Med Chem31:1679-86 (1988) Renin
Name:Renin
Type:PROTEIN
Mol. Mass.:44272.67
Organism:Rattus norvegicus
Description:ChEMBL_222765
Residue:402
BDBM50021990
NameBDBM50021990
Synonyms:CHEMBL427798 | Pro-His-Pro-Phe-His-Statine-Tyr-Tyr-Lys-NH2
TypeSmall organic molecule
Emp. Form.C63H85N15O12
Mol. Mass.1244.4423
SMILESCC(C)C[C@H](NC(=O)[C@H](Cc1cnc[nH]1)NC(=O)[C@H](Cc1ccccc1)NC(=O)[C@H]1CCCN1C(=O)[C@H](Cc1cnc[nH]1)NC(=O)[C@H]1CCCN1)[C@@H](O)CC(=O)N[C@@H](Cc1ccc(O)cc1)C(=O)N[C@@H](Cc1ccc(O)cc1)C(=O)NC(CCCCN)C(N)=O