Reaction Details
TargetRenin
LigandBDBM50021993
Substrate/Competitorn/a
Meas. Tech.ChEBML_196299
IC50 34±n/a nM
Citation Hui, KYHoltzman, EJQuinones, MAHollenberg, NKHaber, E Design of rat renin inhibitory peptides. J Med Chem31:1679-86 (1988) Renin
Name:Renin
Type:PROTEIN
Mol. Mass.:44272.67
Organism:Rattus norvegicus
Description:ChEMBL_222765
Residue:402
BDBM50021993
NameBDBM50021993
Synonyms:1-[2-Acetylamino-3-(4-methoxy-phenyl)-propionyl]-pyrrolidine-2-carboxylic acid {1-[1-(1-{2-[1-(1-carbamoyl-2-phenyl-ethylcarbamoyl)-3-methyl-butylcarbamoyl]-1-hydroxy-ethyl}-3-methyl-butylcarbamoyl)-2-methyl-propylcarbamoyl]-2-phenyl-ethyl}-amide | CHEMBL268332
TypeSmall organic molecule
Emp. Form.C54H76N8O10
Mol. Mass.997.2288
SMILESCOc1ccc(C[C@H](NC(C)=O)C(=O)N2CCC[C@@H]2C(=O)N[C@@H](Cc2ccccc2)C(=O)N[C@@H](C(C)C)C(=O)N[C@@H](CC(C)C)[C@@H](O)CC(=O)N[C@@H](CC(C)C)C(=O)N[C@@H](Cc2ccccc2)C(N)=O)cc1