Reaction Details
TargetRenin
LigandBDBM50021994
Substrate/Competitorn/a
Meas. Tech.ChEBML_196299
IC50 150±n/a nM
Citation Hui, KYHoltzman, EJQuinones, MAHollenberg, NKHaber, E Design of rat renin inhibitory peptides. J Med Chem31:1679-86 (1988) Renin
Name:Renin
Type:PROTEIN
Mol. Mass.:44272.67
Organism:Rattus norvegicus
Description:ChEMBL_222765
Residue:402
BDBM50021994
NameBDBM50021994
Synonyms:1-[2-Acetylamino-3-(3H-imidazol-4-yl)-propionyl]-pyrrolidine-2-carboxylic acid {1-[1-{1-benzyl-3-[1-(1-carbamoyl-2-phenyl-ethylcarbamoyl)-3-methyl-butylcarbamoyl]-2-hydroxy-propylcarbamoyl}-2-(3H-imidazol-4-yl)-ethylcarbamoyl]-2-phenyl-ethyl}-amide | CHEMBL414518
TypeSmall organic molecule
Emp. Form.C54H68N12O9
Mol. Mass.1029.1927
SMILESCC(C)C[C@H](NC(=O)C[C@H](O)[C@H](Cc1ccccc1)NC(=O)[C@H](Cc1cnc[nH]1)NC(=O)[C@H](Cc1ccccc1)NC(=O)[C@H]1CCCN1C(=O)[C@H](Cc1cnc[nH]1)NC(C)=O)C(=O)N[C@@H](Cc1ccccc1)C(N)=O