Reaction Details
TargetRenin
LigandBDBM50021998
Substrate/Competitorn/a
Meas. Tech.ChEBML_196299
IC50 1600±n/a nM
Citation Hui, KYHoltzman, EJQuinones, MAHollenberg, NKHaber, E Design of rat renin inhibitory peptides. J Med Chem31:1679-86 (1988) Renin
Name:Renin
Type:PROTEIN
Mol. Mass.:44272.67
Organism:Rattus norvegicus
Description:ChEMBL_222765
Residue:402
BDBM50021998
NameBDBM50021998
Synonyms:CHEMBL437044 | Pro-His-Pro-Phe-His-Statine-Tyr-Tyr-NH2
TypeSmall organic molecule
Emp. Form.C57H73N13O11
Mol. Mass.1116.27
SMILESCC(C)C[C@H](NC(=O)[C@H](Cc1cnc[nH]1)NC(=O)[C@H](Cc1ccccc1)NC(=O)[C@H]1CCCN1C(=O)[C@H](Cc1cnc[nH]1)NC(=O)[C@H]1CCCN1)[C@@H](O)CC(=O)N[C@@H](Cc1ccc(O)cc1)C(=O)N[C@@H](Cc1ccc(O)cc1)C(N)=O