Reaction Details
TargetRenin
LigandBDBM50022000
Substrate/Competitorn/a
Meas. Tech.ChEBML_196299
IC50 8900±n/a nM
Citation Hui, KYHoltzman, EJQuinones, MAHollenberg, NKHaber, E Design of rat renin inhibitory peptides. J Med Chem31:1679-86 (1988) Renin
Name:Renin
Type:PROTEIN
Mol. Mass.:44272.67
Organism:Rattus norvegicus
Description:ChEMBL_222765
Residue:402
BDBM50022000
NameBDBM50022000
Synonyms:CHEMBL2371853 | Pro-His-Pro-Phe-His-Statine-Val-Tyr-NH2
TypeSmall organic molecule
Emp. Form.C59H84N14O12
Mol. Mass.1181.3849
SMILESCC(C)C[C@H](NC(=O)[C@H](Cc1c[nH]cn1)NC(=O)[C@H](Cc1ccccc1)NC(=O)[C@@H]1CCCN1C(=O)[C@H](Cc1c[nH]cn1)NC(=O)[C@@H]1CCCN1)[C@@H](O)CC(=O)N[C@@H](C(C)C)C(=O)N[C@@H](Cc1ccc(O)cc1)C(=O)N[C@@H](CCCCN)C(O)=O