Reaction Details
TargetRenin
LigandBDBM50367764
Substrate/Competitorn/a
Meas. Tech.ChEBML_196299
IC50 10000±n/a nM
Citation Hui, KYHoltzman, EJQuinones, MAHollenberg, NKHaber, E Design of rat renin inhibitory peptides. J Med Chem31:1679-86 (1988) Renin
Name:Renin
Type:PROTEIN
Mol. Mass.:44272.67
Organism:Rattus norvegicus
Description:ChEMBL_222765
Residue:402
BDBM50367764
NameBDBM50367764
Synonyms:CHEMBL264339
TypeSmall organic molecule
Emp. Form.C54H75N13O9
Mol. Mass.1050.255
SMILESCC[C@H](C)[C@H](NC(=O)CC(O)C(CC(C)C)NC(=O)[C@H](Cc1c[nH]cn1)NC(=O)[C@H](Cc1ccccc1)NC(=O)[C@@H]1CCCN1C(=O)[C@H](Cc1c[nH]cn1)NC(=O)[C@@H]1CCCN1)C(=O)NC(=O)[C@@H](N)Cc1ccccc1