Reaction Details
TargetRenin
LigandBDBM50022008
Substrate/Competitorn/a
Meas. Tech.ChEBML_196299
IC50 240±n/a nM
Citation Hui, KYHoltzman, EJQuinones, MAHollenberg, NKHaber, E Design of rat renin inhibitory peptides. J Med Chem31:1679-86 (1988) Renin
Name:Renin
Type:PROTEIN
Mol. Mass.:44272.67
Organism:Rattus norvegicus
Description:ChEMBL_222765
Residue:402
BDBM50022008
NameBDBM50022008
Synonyms:Ac-His-Pro-Trp-His-Statine-Leu-Phe-NH2 | CHEMBL384923
TypeSmall organic molecule
Emp. Form.C53H71N13O9
Mol. Mass.1034.2125
SMILESCC(C)C[C@H](NC(=O)[C@H](Cc1cnc[nH]1)NC(=O)[C@H](Cc1c[nH]c2ccccc12)NC(=O)[C@H]1CCCN1C(=O)[C@H](Cc1cnc[nH]1)NC(C)=O)[C@@H](O)CC(=O)N[C@@H](CC(C)C)C(=O)N[C@@H](Cc1ccccc1)C(N)=O