Reaction Details
TargetRenin
LigandBDBM50022007
Substrate/Competitorn/a
Meas. Tech.ChEBML_195759
IC50 15±n/a nM
Citation Hui, KYHoltzman, EJQuinones, MAHollenberg, NKHaber, E Design of rat renin inhibitory peptides. J Med Chem31:1679-86 (1988) Renin
Name:Renin
Type:Enzyme
Mol. Mass.:45058.99
Organism:Homo sapiens (Human)
Description:n/a
Residue:406
BDBM50022007
NameBDBM50022007
Synonyms:1-[2-Acetylamino-3-(3H-imidazol-4-yl)-propionyl]-pyrrolidine-2-carboxylic acid [1-(1-{3-[1-(1-carbamoyl-2-phenyl-ethylcarbamoyl)-3-methyl-butylcarbamoyl]-1-cyclohexylmethyl-2-hydroxy-propylcarbamoyl}-2-methyl-propylcarbamoyl)-2-phenyl-ethyl]-amide | CHEMBL413085
TypeSmall organic molecule
Emp. Form.C53H76N10O9
Mol. Mass.997.2321
SMILESCC(C)C[C@H](NC(=O)C[C@H](O)[C@H](CC1CCCCC1)NC(=O)[C@@H](NC(=O)[C@H](Cc1ccccc1)NC(=O)[C@H]1CCCN1C(=O)[C@H](Cc1cnc[nH]1)NC(C)=O)C(C)C)C(=O)N[C@@H](Cc1ccccc1)C(N)=O