Reaction Details
TargetRenin
LigandBDBM50022012
Substrate/Competitorn/a
Meas. Tech.ChEBML_196299
IC50 1900±n/a nM
Citation Hui, KYHoltzman, EJQuinones, MAHollenberg, NKHaber, E Design of rat renin inhibitory peptides. J Med Chem31:1679-86 (1988) Renin
Name:Renin
Type:PROTEIN
Mol. Mass.:44272.67
Organism:Rattus norvegicus
Description:ChEMBL_222765
Residue:402
BDBM50022012
NameBDBM50022012
Synonyms:Ac-His-Pro-Phe-His-Statine-tLeu-Phe-NH2 | CHEMBL404799
TypeSmall organic molecule
Emp. Form.C51H70N12O9
Mol. Mass.995.1765
SMILESCC(C)C[C@H](NC(=O)[C@H](Cc1cnc[nH]1)NC(=O)[C@H](Cc1ccccc1)NC(=O)[C@H]1CCCN1C(=O)[C@H](Cc1cnc[nH]1)NC(C)=O)[C@@H](O)CC(=O)N[C@H](C(=O)N[C@@H](Cc1ccccc1)C(N)=O)C(C)(C)C