Reaction Details
TargetRenin
LigandBDBM50022014
Substrate/Competitorn/a
Meas. Tech.ChEBML_196299
IC50 280±n/a nM
Citation Hui, KYHoltzman, EJQuinones, MAHollenberg, NKHaber, E Design of rat renin inhibitory peptides. J Med Chem31:1679-86 (1988) Renin
Name:Renin
Type:PROTEIN
Mol. Mass.:44272.67
Organism:Rattus norvegicus
Description:ChEMBL_222765
Residue:402
BDBM50022014
NameBDBM50022014
Synonyms:1-(2-Acetylamino-2-cyclohexyl-acetyl)-pyrrolidine-2-carboxylic acid {1-[1-(1-{2-[1-(1-carbamoyl-2-phenyl-ethylcarbamoyl)-3-methyl-butylcarbamoyl]-1-hydroxy-ethyl}-3-methyl-butylcarbamoyl)-2-methyl-propylcarbamoyl]-2-phenyl-ethyl}-amide | CHEMBL262686
TypeSmall organic molecule
Emp. Form.C52H78N8O9
Mol. Mass.959.2239
SMILESCC(C)C[C@H](NC(=O)[C@@H](NC(=O)[C@H](Cc1ccccc1)NC(=O)[C@H]1CCCN1C(=O)[C@@H](NC(C)=O)C1CCCCC1)C(C)C)[C@@H](O)CC(=O)N[C@@H](CC(C)C)C(=O)N[C@@H](Cc1ccccc1)C(N)=O