Reaction Details
TargetAdenosylhomocysteinase
LigandBDBM50023884
Substrate/Competitorn/a
Meas. Tech.ChEBML_197203
Ki 500±n/a nM
Citation Borcherding, DRNarayanan, SHasobe, MMcKee, JGKeller, BTBorchardt, RT Potential inhibitors of S-adenosylmethionine-dependent methyltransferases. 11. Molecular dissections of neplanocin A as potential inhibitors of S-adenosylhomocysteine hydrolase. J Med Chem31:1729-38 (1988) Adenosylhomocysteinase
Name:Adenosylhomocysteinase
Type:PROTEIN
Mol. Mass.:47714.06
Organism:Homo sapiens (Human)
Description:ChEMBL_1507791
Residue:432
BDBM50023884
NameBDBM50023884
Synonyms:4-(6-Amino-purin-9-yl)-2-methyl-but-2-en-1-ol | CHEMBL295729
TypeSmall organic molecule
Emp. Form.C10H13N5O
Mol. Mass.219.2431
SMILESC\C(CO)=C/Cn1cnc2c(N)ncnc12