Reaction Details
TargetAdenosylhomocysteinase
LigandBDBM50023885
Substrate/Competitorn/a
Meas. Tech.ChEBML_197203
Ki 160±n/a nM
Citation Borcherding, DRNarayanan, SHasobe, MMcKee, JGKeller, BTBorchardt, RT Potential inhibitors of S-adenosylmethionine-dependent methyltransferases. 11. Molecular dissections of neplanocin A as potential inhibitors of S-adenosylhomocysteine hydrolase. J Med Chem31:1729-38 (1988) Adenosylhomocysteinase
Name:Adenosylhomocysteinase
Type:PROTEIN
Mol. Mass.:47714.06
Organism:Homo sapiens (Human)
Description:ChEMBL_1507791
Residue:432
BDBM50023885
NameBDBM50023885
Synonyms:4-(4-Amino-imidazo[4,5-c]pyridin-1-yl)-but-2-yn-1-ol | CHEMBL49511
TypeSmall organic molecule
Emp. Form.C10H10N4O
Mol. Mass.202.2126
SMILESNc1nccc2n(CC#CCO)cnc12