Reaction Details
TargetAdenosylhomocysteinase
LigandBDBM50006222
Substrate/Competitorn/a
Meas. Tech.ChEBML_197366
IC50 50±n/a nM
Citation Borcherding, DRNarayanan, SHasobe, MMcKee, JGKeller, BTBorchardt, RT Potential inhibitors of S-adenosylmethionine-dependent methyltransferases. 11. Molecular dissections of neplanocin A as potential inhibitors of S-adenosylhomocysteine hydrolase. J Med Chem31:1729-38 (1988) Adenosylhomocysteinase
Name:Adenosylhomocysteinase
Type:PROTEIN
Mol. Mass.:47687.65
Organism:Mus musculus
Description:ChEMBL_196559
Residue:432
BDBM50006222
NameBDBM50006222
Synonyms:(1S,2R,5R)-5-(6-Amino-purin-9-yl)-3-hydroxymethyl-cyclopent-3-ene-1,2-diol 5-(6-Amino-purin-9-yl)-3-hydroxymethyl-cyclopent-3-ene-1,2-diol 5-(6-Amino-purin-9-yl)-3-hydroxymethyl-cyclopent-3-ene-1,2-diol (Neplonocin A) 5-(6-Amino-purin-9-yl)-3-hydroxymethyl-cyclopent-3-ene-1,2-diol(NPA) CHEMBL8771 | Neplanocin A
TypeSmall organic molecule
Emp. Form.C11H13N5O3
Mol. Mass.263.2526
SMILESNc1ncnc2n(cnc12)[C@@H]1C=C(CO)[C@@H](O)[C@H]1O