Reaction Details
TargetPotassium-transporting ATPase alpha chain 1/subunit beta
LigandBDBM50367770
Substrate/Competitorn/a
Meas. Tech.ChEMBL_164918 (CHEMBL872006)
IC50 120±n/a nM
Citation Sanfilippo, PJUrbanski, MPress, JBHajos, ZGShriver, DAScott, CK Synthesis of (aryloxy)alkylamines. 1. Novel antisecretory agents with H+K+-ATPase inhibitory activity. J Med Chem31:1778-85 (1988) Potassium-transporting ATPase alpha chain 1/subunit beta
Name:Potassium-transporting ATPase alpha chain 1/subunit beta
Type:n/a
Mol. Mass.:n/a
Description:ASSAY_ID of EBI is 71495
Components:This complex has 2 components.
Component 1
Name:Potassium-transporting ATPase alpha chain 1
Synonyms:ATP4A Gastric H(+)/K(+) ATPase subunit alpha Potassium-transporting ATPase alpha chain 1 | Proton pump
Type:PROTEIN
Mol. Mass.:114109.05
Organism:Homo sapiens (Human)
Description:EBI_82
Residue:1035
Component 2
Name:Potassium-transporting ATPase subunit beta
Synonyms:ATP4B Gastric H(+)/K(+) ATPase subunit beta Potassium-transporting ATPase subunit beta | Proton pump beta chain
Type:PROTEIN
Mol. Mass.:33369.83
Organism:Homo sapiens (Human)
Description:EBI_10719
Residue:291
BDBM50367770
NameBDBM50367770
Synonyms:CHEMBL1202663
TypeSmall organic molecule
Emp. Form.C27H36N2OS
Mol. Mass.436.653
SMILESCCCCN(CCCC)CCCCOc1ccc(cc1)-c1csc(n1)-c1ccccc1