Reaction Details
TargetNeprilysin
LigandBDBM50367821
Substrate/Competitorn/a
Meas. Tech.ChEBML_144760
IC50 2.5±n/a nM
Citation Hernandez, JFSoleilhac, JMRoques, BPFournié-Zaluski, MC Retro-inverso concept applied to the complete inhibitors of enkephalin-degrading enzymes. J Med Chem31:1825-31 (1988) Neprilysin
Name:Neprilysin
Type:Enzyme
Mol. Mass.:85570.75
Organism:Oryctolagus cuniculus (rabbit)
Description:NEP was purified to homogeneity from rabbit kidney.
Residue:750
BDBM50367821
NameBDBM50367821
Synonyms:CHEMBL1907791
TypeSmall organic molecule
Emp. Form.C13H16N2O5
Mol. Mass.280.2765
SMILESONC(=O)C[C@H](Cc1ccccc1)NC(=O)CC(O)=O