Reaction Details
TargetGastrin/cholecystokinin type B receptor
LigandBDBM81962
Substrate/Competitorn/a
Meas. Tech.ChEMBL_47963 (CHEMBL656251)
IC50 2±n/a nM
Citation Bock, MGDiPardo, RMEvans, BERittle, KEWhitter, WLVeber, DEAnderson, PSFreidinger, RM Benzodiazepine gastrin and brain cholecystokinin receptor ligands: L-365,260. J Med Chem32:13-6 (1989) Gastrin/cholecystokinin type B receptor
Name:Gastrin/cholecystokinin type B receptor
Type:G Protein-Coupled Receptor (GPCR)
Mol. Mass.:48445.79
Organism:Homo sapiens (Human)
Description:Stable expression of human CCK-2 receptors in HEK 293 cells.
Residue:447
BDBM81962
NameBDBM81962
Synonyms:S-L-365,260
Typen/a
Emp. Form.C24H22N4O2
Mol. Mass.398.4571
SMILESCN1c2ccccc2C(=N[C@@H](NC(=O)Nc2cccc(C)c2)C1=O)c1ccccc1