Reaction Details
TargetThymidylate synthase
LigandBDBM50227823
Substrate/Competitorn/a
Meas. Tech.ChEMBL_72641 (CHEMBL684345)
Ki 93000±n/a nM
Citation Broom, AD Rational design of enzyme inhibitors: multisubstrate analogue inhibitors. J Med Chem32:2-7 (1989) Thymidylate synthase
Name:Thymidylate synthase
Type:Enzyme
Mol. Mass.:35718.07
Organism:Homo sapiens (Human)
Description:n/a
Residue:313
BDBM50227823
NameBDBM50227823
Synonyms:CHEMBL3392214
TypeSmall organic molecule
Emp. Form.C17H19N9O4S
Mol. Mass.445.456
SMILESNc1nc(O)c2cc(CSC[C@H]3O[C@H]([C@H](O)[C@@H]3O)n3cnc4c(N)ncnc34)[nH]c2n1