Reaction Details
TargetThymidylate synthase
LigandBDBM50017762
Substrate/Competitorn/a
Meas. Tech.ChEMBL_210133 (CHEMBL812502)
Ki 750±n/a nM
Citation Broom, AD Rational design of enzyme inhibitors: multisubstrate analogue inhibitors. J Med Chem32:2-7 (1989) Thymidylate synthase
Name:Thymidylate synthase
Type:Enzyme
Mol. Mass.:35718.07
Organism:Homo sapiens (Human)
Description:n/a
Residue:313
BDBM50017762
NameBDBM50017762
Synonyms:2-(4-{[2-Amino-5-(2,4-dioxo-1,2,3,4-tetrahydro-pyrimidin-5-ylmethyl)-4-oxo-3,4,5,6,7,8-hexahydro-pteridin-6-ylmethyl]-methyl-amino}-benzoylamino)-pentanedioic acid
TypeSmall organic molecule
Emp. Form.C25H27N9O8
Mol. Mass.581.5385
SMILESCN(CC1CNc2nc(N)[nH]c(=O)c2N1Cc1c[nH]c(=O)[nH]c1=O)c1ccc(cc1)C(=O)NC(CCC([O-])=O)C([O-])=O