Reaction Details
TargetProstaglandin F2-alpha receptor
LigandBDBM50035622
Substrate/Competitorn/a
Meas. Tech.ChEBML_152620
IC50 140±n/a nM
Citation Kawada, KDolence, EKMorita, HKometani, TWatt, DSBalapure, AFitz, TAOrlicky, DJGerschenson, LE Prostaglandin photoaffinity probes: synthesis and biological activity of azide-substituted 16-phenoxy- and 17-phenyl-PGF2 alpha prostaglandins. J Med Chem32:256-64 (1989) Prostaglandin F2-alpha receptor
Name:Prostaglandin F2-alpha receptor
Type:Enzyme Catalytic Domain
Mol. Mass.:41044.75
Organism:BOVINE
Description:ProstaglandinF2Alpha PTGFR BOVINE::P37289
Residue:362
BDBM50035622
NameBDBM50035622
Synonyms:(5Z,13E,15S)-9alpha,11alpha,15-trihydroxyprosta-5,13-dien-1-oic acid DINOPROST l-PGF2-alpha prostaglandin F2alpha
TypeSmall organic molecule
Emp. Form.C20H34O5
Mol. Mass.354.481
SMILESCCCCC[C@H](O)\C=C\[C@H]1[C@H](O)C[C@H](O)[C@@H]1C\C=C/CCCC(O)=O