Reaction Details
TargetPlatelet-activating factor receptor
LigandBDBM50005232
Substrate/Competitorn/a
Meas. Tech.ChEBML_164923
IC50 75±n/a nM
Citation Takatani, MYoshioka, YTasaka, ATerashita, ZImura, YNishikawa, KTsushima, S Platelet activating factor antagonists: synthesis and structure-activity studies of novel PAF analogues modified in the phosphorylcholine moiety. J Med Chem32:56-64 (1989) Platelet-activating factor receptor
Name:Platelet-activating factor receptor
Type:Protein
Mol. Mass.:39005.63
Organism:Cavia porcellus
Description:n/a
Residue:342
BDBM50005232
NameBDBM50005232
Synonyms:(R)-2-{[Acetyl-(2-methoxy-3-octadecylcarbamoyloxy-propoxycarbonyl)-amino]-methyl}-1-ethyl-pyridinium; chloride 2-{[Acetyl-(2-methoxy-3-octadecylcarbamoyloxy-propoxycarbonyl)-amino]-methyl}-1-ethyl-pyridinium; chloride CHEMBL274420 | CV-6209
TypeSmall organic molecule
Emp. Form.C34H60N3O6
Mol. Mass.606.8562
(=O)OCC(COC(=O)N(Cc1cccc[n+]1CC)C(C)=O)OC