Reaction Details
TargetAdenosine receptor A2a/A2b
LigandBDBM50267393
Substrate/Competitorn/a
Meas. Tech.ChEMBL_30724 (CHEMBL648803)
Ki 1870±n/a nM
Citation Trivedi, BKBridges, AJPatt, WCPriebe, SRBruns, RF N6-bicycloalkyladenosines with unusually high potency and selectivity for the adenosine A1 receptor. J Med Chem32:8-11 (1989) Adenosine receptor A2a/A2b
Name:Adenosine receptor A2a/A2b
Synonyms:Adenosine A2 receptor
Type:n/a
Mol. Mass.:n/a
Description:ASSAY_ID of ChEMBL is 30560
Components:This complex has 2 components.
Component 1
Name:Adenosine receptor A2b
Type:PROTEIN
Mol. Mass.:36378.84
Organism:Rattus norvegicus
Description:ChEMBL_32934
Residue:332
Component 2
Name:Adenosine receptor A2a
Synonyms:AA2AR_RAT Adenosine A2 receptor Adenosine Receptors A2a (A2a) Adenosine receptors A2a Rat striatal adenosine A2a receptor
Type:G Protein-Coupled Receptor (GPCR)
Mol. Mass.:45015.65
Organism:Rattus norvegicus (rat)
Description:Rat A2A receptors expressed in CHO cells.
Residue:410
BDBM50267393
NameBDBM50267393
Synonyms:CHEMBL477444 | N6-Cyclopentyl-9H-(5-chloro-5-deoxy-beta-D-ribofuranosyl)adenine
TypeSmall organic molecule
Emp. Form.C15H20ClN5O3
Mol. Mass.353.804
SMILESO[C@@H]1[C@@H](CCl)O[C@H]([C@@H]1O)n1cnc2c(NC3CCCC3)ncnc12