Reaction Details
TargetAdenosine receptor A1
LigandBDBM50367844
Substrate/Competitorn/a
Meas. Tech.ChEBML_29460
Ki 1.7±n/a nM
Citation Trivedi, BKBridges, AJPatt, WCPriebe, SRBruns, RF N6-bicycloalkyladenosines with unusually high potency and selectivity for the adenosine A1 receptor. J Med Chem32:8-11 (1989) Adenosine receptor A1
Name:Adenosine receptor A1
Type:Protein
Mol. Mass.:36704.13
Organism:Rattus norvegicus (rat)
Description:n/a
Residue:326
BDBM50367844
NameBDBM50367844
Synonyms:CHEMBL2112184
TypeSmall organic molecule
Emp. Form.C17H23N5O4
Mol. Mass.361.3956
SMILES[H][C@@]12CC[C@@]([H])(C1)[C@@]([H])(C2)Nc1ncnc2n(cnc12)[C@@H]1O[C@H](CO)[C@@H](O)[C@H]1O