Reaction Details
TargetNeprilysin
LigandBDBM21641
Substrate/Competitorn/a
Meas. Tech.ChEMBL_64506 (CHEMBL676651)
IC50 5±n/a nM
Citation Ksander, GMDiefenbacher, CGYuan, AMClark, FSakane, YGhai, RD Enkephalinase inhibitors. 1. 2,4-Dibenzylglutaric acid derivatives. J Med Chem32:2519-26 (1989) Neprilysin
Name:Neprilysin
Type:Enzyme
Mol. Mass.:85570.75
Organism:Oryctolagus cuniculus (rabbit)
Description:NEP was purified to homogeneity from rabbit kidney.
Residue:750
BDBM21641
NameBDBM21641
Synonyms:2-(2-benzyl-3-sulfanylpropanamido)acetic acid Thiorphan
TypeSmall organic molecule
Emp. Form.C12H15NO3S
Mol. Mass.253.317
SMILESOC(=O)CNC(=O)C(CS)Cc1ccccc1