Reaction Details
TargetDelta-type opioid receptor
LigandBDBM50452590
Substrate/Competitorn/a
Meas. Tech.ChEMBL_147195 (CHEMBL756871)
Ki 0.940000±n/a nM
Citation Bryan, WMCallahan, JFCodd, EELemieux, CMoore, MLSchiller, PWWalker, RFHuffman, WF Cyclic enkephalin analogues containing alpha-amino-beta-mercapto-beta,beta-pentamethylenepropionic acid at positions 2 or 5. J Med Chem32:302-4 (1989) Delta-type opioid receptor
Name:Delta-type opioid receptor
Type:G Protein-Coupled Receptor (GPCR)
Mol. Mass.:40465.04
Organism:Rattus norvegicus (rat)
Description:Competition binding assays were using CHO-K1 cell membranes expressing the opioid receptor.
Residue:372
BDBM50452590
NameBDBM50452590
Synonyms:CHEMBL3084309
TypeSmall organic molecule
Emp. Form.C31H39N5O7S2
Mol. Mass.657.801
SMILESN[C@@H](Cc1ccc(O)cc1)C(=O)N[C@@H]1CSSC2(CCCCC2)[C@H](NC(=O)[C@H](Cc2ccccc2)NC(=O)CNC1=O)C(O)=O