Reaction Details
TargetAdenosine receptor A1
LigandBDBM50018009
Substrate/Competitorn/a
Meas. Tech.ChEBML_28977
Ki 2.5±n/a nM
Citation Jacobson, KABarone, SKammula, UStiles, GL Electrophilic derivatives of purines as irreversible inhibitors of A1 adenosine receptors. J Med Chem32:1043-51 (1989) Adenosine receptor A1
Name:Adenosine receptor A1
Type:Protein
Mol. Mass.:36704.13
Organism:Rattus norvegicus (rat)
Description:n/a
Residue:326
BDBM50018009
NameBDBM50018009
Synonyms:3-(2-{2-[4-(2,6-Dioxo-1,3-dipropyl-2,3,6,7-tetrahydro-1H-purin-8-yl)-phenoxy]-acetylamino}-ethylsulfamoyl)-benzenesulfonyl chloride | CHEMBL9180
TypeSmall organic molecule
Emp. Form.C27H31ClN6O8S2
Mol. Mass.667.153
SMILESCCCn1c2nc([nH]c2c(=O)n(CCC)c1=O)-c1ccc(OCC(=O)NCCNS(=O)(=O)c2cccc(c2)S(Cl)(=O)=O)cc1