Reaction Details
TargetD(2) dopamine receptor
LigandBDBM50016972
Substrate/Competitorn/a
Meas. Tech.ChEBML_58528
IC50>1000±n/a nM
Citation New, JSChristopher, WLYevich, JPButler, RSchlemmer, RFVanderMaelen, CPCipollina, JA The thieno[3,2-c]pyridine and furo[3,2-c]pyridine rings: new pharmacophores with potential antipsychotic activity. J Med Chem32:1147-56 (1989) D(2) dopamine receptor
Name:D(2) dopamine receptor
Type:G Protein-Coupled Receptor (GPCR)
Mol. Mass.:50931.60
Organism:Rattus norvegicus (rat)
Description:P61169
Residue:444
BDBM50016972
NameBDBM50016972
Synonyms:4-Piperazin-1-yl-furo[3,2-c]pyridine; hydrochloride CHEMBL595555
TypeSmall organic molecule
Emp. Form.C11H13N3O
Mol. Mass.203.2404
SMILESC1CN(CCN1)c1nccc2occc12