Reaction Details
TargetDelta-type opioid receptor
LigandBDBM50017233
Substrate/Competitorn/a
Meas. Tech.ChEBML_146883
IC50 2.9±n/a nM
Citation Fujimoto, RABoxer, JJackson, RHSimke, JPNeale, RFSnowhill, EWBarbaz, BJWilliams, MSills, MA Synthesis, opioid receptor binding profile, and antinociceptive activity of 1-azaspiro[4.5]decan-10-yl amides. J Med Chem32:1259-65 (1989) Delta-type opioid receptor
Name:Delta-type opioid receptor
Type:G Protein-Coupled Receptor (GPCR)
Mol. Mass.:40382.98
Organism:Homo sapiens (Human)
Description:Competition binding assays were carried out using membrane preparations from transfected HN9.10 cells that constitutively expressed the delta opioid receptor.
Residue:372
BDBM50017233
NameBDBM50017233
Synonyms:CHEMBL592 LEVORPHANOL
TypeSmall organic molecule
Emp. Form.C17H23NO
Mol. Mass.257.3706
SMILESCN1CC[C@]23CCCC[C@H]2[C@H]1Cc1ccc(O)cc31