Reaction Details
TargetLeucyl-cystinyl aminopeptidase
LigandBDBM23971
Substrate/Competitorn/a
Meas. Tech.ChEMBL_98526 (CHEMBL706546)
Ki 20±n/a nM
Citation Harbeson, SLRich, DH Inhibition of aminopeptidases by peptides containing ketomethylene and hydroxyethylene amide bond replacements. J Med Chem32:1378-92 (1989) Leucyl-cystinyl aminopeptidase
Name:Leucyl-cystinyl aminopeptidase
Type:PROTEIN
Mol. Mass.:117179.39
Organism:Rattus norvegicus
Description:ChEMBL_98523
Residue:1025
BDBM23971
NameBDBM23971
Synonyms:(2S)-2-[(2S,3R)-3-amino-2-hydroxy-4-phenylbutanamido]-4-methylpentanoic acid CHEMBL29292 | Ubenimex
TypeSmall organic molecule
Emp. Form.C16H24N2O4
Mol. Mass.308.3728
SMILESCC(C)C[C@H](NC(=O)[C@@H](O)[C@H](N)Cc1ccccc1)C(O)=O