Reaction Details
TargetChymotrypsin-like elastase family member 1/2A
LigandBDBM50228232
Substrate/Competitorn/a
Meas. Tech.ChEMBL_152341 (CHEMBL758722)
Ki 4200000±n/a nM
Citation Harbeson, SLRich, DH Inhibition of aminopeptidases by peptides containing ketomethylene and hydroxyethylene amide bond replacements. J Med Chem32:1378-92 (1989) Chymotrypsin-like elastase family member 1/2A
Name:Chymotrypsin-like elastase family member 1/2A
Synonyms:Pancreatic elastase
Type:n/a
Mol. Mass.:n/a
Description:ASSAY_ID of ChEMBL is 152345
Components:This complex has 2 components.
Component 1
Name:Chymotrypsin-like elastase family member 1
Type:Enzyme
Mol. Mass.:28827.71
Organism:Sus scrofa (Pig)
Description:P00772
Residue:266
Component 2
Name:Chymotrypsin-like elastase family member 2A
Synonyms:CEL2A_PIG ELA2 Elastase 2A Elastase-2A | Pancreatic elastase
Type:PROTEIN
Mol. Mass.:28705.23
Organism:Sus scrofa
Description:ChEMBL_156951
Residue:269
BDBM50228232
NameBDBM50228232
Synonyms:CHEMBL283817
TypeSmall organic molecule
Emp. Form.C14H17NO4
Mol. Mass.263.2891
SMILESCOC(=O)CCC(=O)C(C)NC(=O)c1ccccc1