Reaction Details
TargetMuscarinic acetylcholine receptor M2
LigandBDBM50005685
Substrate/Competitorn/a
Meas. Tech.ChEBML_140183
Ki 1.7±n/a nM
Citation Leader, HSmejkal, RMPayne, CSPadilla, FNDoctor, BPGordon, RKChiang, PK Binary antidotes for organophosphate poisoning: aprophen analogues that are both antimuscarinics and carbamates. J Med Chem32:1522-8 (1989) Muscarinic acetylcholine receptor M2
Name:Muscarinic acetylcholine receptor M2
Type:Enzyme Catalytic Domain
Mol. Mass.:51555.53
Organism:RAT
Description:P10980
Residue:466
BDBM50005685
NameBDBM50005685
Synonyms:2,2-Diphenyl-propionic acid 2-diethylamino-ethyl ester 2-(diethylamino)ethyl 2,2-diphenylpropanoate Aprophen | CHEMBL26505
TypeSmall organic molecule
Emp. Form.C21H27NO2
Mol. Mass.325.4446
SMILESCCN(CC)CCOC(=O)C(C)(c1ccccc1)c1ccccc1