Reaction Details
TargetKappa-type opioid receptor
LigandBDBM50452622
Substrate/Competitorn/a
Meas. Tech.ChEBML_145957
Ki>1000±n/a nM
Citation Halfpenny, PRHill, RGHorwell, DCHughes, JHunter, JCJohnson, SRees, DC Highly selective kappa-opioid analgesics. 2. Synthesis and structure-activity relationships of novel N-[(2-aminocyclohexyl)aryl]acetamide derivatives. J Med Chem32:1620-6 (1989) Kappa-type opioid receptor
Name:Kappa-type opioid receptor
Type:G Protein-Coupled Receptor (GPCR)
Mol. Mass.:42648.76
Organism:Homo sapiens (Human)
Description:P41145
Residue:380
BDBM50452622
NameBDBM50452622
Synonyms:CHEMBL2093981
TypeSmall organic molecule
Emp. Form.C22H31ClN2O2S
Mol. Mass.423.012
SMILESCl.CN([C@@H]1CCCC[C@H]1N1CCC[C@H]1CO)C(=O)Cc1cccc2sccc12