Reaction Details
TargetKappa-type opioid receptor
LigandBDBM50017488
Substrate/Competitorn/a
Meas. Tech.ChEMBL_145957 (CHEMBL752206)
Ki 16±n/a nM
Citation Halfpenny, PRHill, RGHorwell, DCHughes, JHunter, JCJohnson, SRees, DC Highly selective kappa-opioid analgesics. 2. Synthesis and structure-activity relationships of novel N-[(2-aminocyclohexyl)aryl]acetamide derivatives. J Med Chem32:1620-6 (1989) Kappa-type opioid receptor
Name:Kappa-type opioid receptor
Type:G Protein-Coupled Receptor (GPCR)
Mol. Mass.:42648.76
Organism:Homo sapiens (Human)
Description:P41145
Residue:380
BDBM50017488
NameBDBM50017488
Synonyms:2-Benzofuran-4-yl-N-(4,5-dimethoxy-2-pyrrolidin-1-yl-cyclohexyl)-N-methyl-acetamide; hydrochloride | CHEMBL555835
TypeSmall organic molecule
Emp. Form.C23H32N2O4
Mol. Mass.400.5112
SMILESCO[C@H]1C[C@@H]([C@H](C[C@H]1OC)N1CCCC1)N(C)C(=O)Cc1cccc2occc12