Reaction Details
TargetKappa-type opioid receptor
LigandBDBM50017495
Substrate/Competitorn/a
Meas. Tech.ChEBML_145957
Ki 7±n/a nM
Citation Halfpenny, PRHill, RGHorwell, DCHughes, JHunter, JCJohnson, SRees, DC Highly selective kappa-opioid analgesics. 2. Synthesis and structure-activity relationships of novel N-[(2-aminocyclohexyl)aryl]acetamide derivatives. J Med Chem32:1620-6 (1989) Kappa-type opioid receptor
Name:Kappa-type opioid receptor
Type:G Protein-Coupled Receptor (GPCR)
Mol. Mass.:42648.76
Organism:Homo sapiens (Human)
Description:P41145
Residue:380
BDBM50017495
NameBDBM50017495
Synonyms:2-Benzo[b]thiophen-4-yl-N-[2-(3-hydroxymethyl-pyrrolidin-1-yl)-cyclohexyl]-N-methyl-acetamide; hydrochloride | CHEMBL541804
TypeSmall organic molecule
Emp. Form.C22H30N2O2S
Mol. Mass.386.551
SMILESCN([C@@H]1CCCC[C@H]1N1CCC(CO)C1)C(=O)Cc1cccc2sccc12