Reaction Details
TargetMu-type opioid receptor
LigandBDBM50017500
Substrate/Competitorn/a
Meas. Tech.ChEBML_149320
Ki 1000±n/a nM
Citation Halfpenny, PRHill, RGHorwell, DCHughes, JHunter, JCJohnson, SRees, DC Highly selective kappa-opioid analgesics. 2. Synthesis and structure-activity relationships of novel N-[(2-aminocyclohexyl)aryl]acetamide derivatives. J Med Chem32:1620-6 (1989) Mu-type opioid receptor
Name:Mu-type opioid receptor
Type:G Protein-Coupled Receptor (GPCR)
Mol. Mass.:44789.51
Organism:Homo sapiens (Human)
Description:P35372
Residue:400
BDBM50017500
NameBDBM50017500
Synonyms:2-Benzo[b]thiophen-4-yl-N-methyl-N-(2-pyrrolidin-1-yl-cycloheptyl)-acetamide; hydrochloride | CHEMBL538230
TypeSmall organic molecule
Emp. Form.C22H30N2OS
Mol. Mass.370.551
SMILESCN([C@@H]1CCCCC[C@H]1N1CCCC1)C(=O)Cc1cccc2sccc12