Reaction Details
TargetMu-type opioid receptor
LigandBDBM50017496
Substrate/Competitorn/a
Meas. Tech.ChEMBL_146569 (CHEMBL755058)
Ki 10000±n/a nM
Citation Halfpenny, PRHill, RGHorwell, DCHughes, JHunter, JCJohnson, SRees, DC Highly selective kappa-opioid analgesics. 2. Synthesis and structure-activity relationships of novel N-[(2-aminocyclohexyl)aryl]acetamide derivatives. J Med Chem32:1620-6 (1989) Mu-type opioid receptor
Name:Mu-type opioid receptor
Type:G Protein-Coupled Receptor (GPCR)
Mol. Mass.:44789.51
Organism:Homo sapiens (Human)
Description:P35372
Residue:400
BDBM50017496
NameBDBM50017496
Synonyms:2-Benzo[b]thiophen-4-yl-N-(2-pyrrolidin-1-yl-ethyl)-acetamide; hydrochloride | CHEMBL554205
TypeSmall organic molecule
Emp. Form.C16H20N2OS
Mol. Mass.288.408
SMILESO=C(Cc1cccc2sccc12)NCCN1CCCC1