Reaction Details
TargetKappa-type opioid receptor
LigandBDBM50017505
Substrate/Competitorn/a
Meas. Tech.ChEMBL_145957 (CHEMBL752206)
Ki 333±n/a nM
Citation Halfpenny, PRHill, RGHorwell, DCHughes, JHunter, JCJohnson, SRees, DC Highly selective kappa-opioid analgesics. 2. Synthesis and structure-activity relationships of novel N-[(2-aminocyclohexyl)aryl]acetamide derivatives. J Med Chem32:1620-6 (1989) Kappa-type opioid receptor
Name:Kappa-type opioid receptor
Type:G Protein-Coupled Receptor (GPCR)
Mol. Mass.:42648.76
Organism:Homo sapiens (Human)
Description:P41145
Residue:380
BDBM50017505
NameBDBM50017505
Synonyms:2-Benzo[b]thiophen-4-yl-N-(2-pyrrolidin-1-yl-cyclohexyl)-acetamide; hydrochloride | CHEMBL545182
TypeSmall organic molecule
Emp. Form.C20H26N2OS
Mol. Mass.342.498
SMILESO=C(Cc1cccc2sccc12)N[C@@H]1CCCC[C@H]1N1CCCC1