Reaction Details
TargetKappa-type opioid receptor
LigandBDBM50017510
Substrate/Competitorn/a
Meas. Tech.ChEBML_145957
Ki 180±n/a nM
Citation Halfpenny, PRHill, RGHorwell, DCHughes, JHunter, JCJohnson, SRees, DC Highly selective kappa-opioid analgesics. 2. Synthesis and structure-activity relationships of novel N-[(2-aminocyclohexyl)aryl]acetamide derivatives. J Med Chem32:1620-6 (1989) Kappa-type opioid receptor
Name:Kappa-type opioid receptor
Type:G Protein-Coupled Receptor (GPCR)
Mol. Mass.:42648.76
Organism:Homo sapiens (Human)
Description:P41145
Residue:380
BDBM50017510
NameBDBM50017510
Synonyms:CHEMBL540277 | Succinic acid bis-(1-{2-[(2-benzofuran-4-yl-acetyl)-methyl-amino]-cyclohexyl}-pyrrolidin-3-ylmethyl) ester;Dihydrochloride
TypeSmall organic molecule
Emp. Form.C48H62N4O8
Mol. Mass.823.0279
SMILESCN([C@H]1CCCC[C@@H]1N1CCC(COC(=O)CCC(=O)OCC2CCN(C2)[C@@H]2CCCC[C@H]2N(C)C(=O)Cc2cccc3occc23)C1)C(=O)Cc1cccc2occc12