Reaction Details
TargetAdenosine receptor A1
LigandBDBM50018430
Substrate/Competitorn/a
Meas. Tech.ChEBML_29628
Ki 2.4±n/a nM
Citation Jacobson, KAKiriasis, LBarone, SBradbury, BJKammula, UCampagne, JMSecunda, SDaly, JWNeumeyer, JLPfleiderer, W Sulfur-containing 1,3-dialkylxanthine derivatives as selective antagonists at A1-adenosine receptors. J Med Chem32:1873-9 (1989) Adenosine receptor A1
Name:Adenosine receptor A1
Type:Protein
Mol. Mass.:36704.13
Organism:Rattus norvegicus (rat)
Description:n/a
Residue:326
BDBM50018430
NameBDBM50018430
Synonyms:CHEMBL293102 | N-(2-Methylamino-ethyl)-2-[4-(6-oxo-1,3-dipropyl-2-thioxo-2,3,6,7-tetrahydro-1H-purin-8-yl)-phenoxy]-acetamide
TypeSmall organic molecule
Emp. Form.C22H30N6O3S
Mol. Mass.458.577
SMILESCCCn1c2nc([nH]c2c(=O)n(CCC)c1=S)-c1ccc(OCC(=O)NCCNC)cc1