Reaction Details
TargetSigma non-opioid intracellular receptor 1
LigandBDBM50017237
Substrate/Competitorn/a
Meas. Tech.ChEBML_201290
Ki 231±n/a nM
Citation Hutchison, AJde Jesus, RWilliams, MSimke, JPNeale, RFJackson, RHAmbrose, FBarbaz, BJSills, MA Benzofuro[2,3-c]pyridin-6-ols: synthesis, affinity for opioid-receptor subtypes, and antinociceptive activity. J Med Chem32:2221-6 (1989) Sigma non-opioid intracellular receptor 1
Name:Sigma non-opioid intracellular receptor 1
Type:Enzyme Catalytic Domain
Mol. Mass.:25246.51
Organism:Mus musculus (Mouse)
Description:O55242
Residue:223
BDBM50017237
NameBDBM50017237
Synonyms:(4aS,9aR)-4a-Ethyl-2-propyl-1,2,3,4,4a,9a-hexahydro-benzo[4,5]furo[2,3-c]pyridin-6-ol | CHEMBL304616
TypeSmall organic molecule
Emp. Form.C16H23NO2
Mol. Mass.261.3593
SMILESCCCN1CC[C@]2(CC)[C@H](C1)Oc1ccc(O)cc21