Reaction Details
TargetSigma non-opioid intracellular receptor 1
LigandBDBM50017232
Substrate/Competitorn/a
Meas. Tech.ChEBML_201290
Ki 2.3±n/a nM
Citation Hutchison, AJde Jesus, RWilliams, MSimke, JPNeale, RFJackson, RHAmbrose, FBarbaz, BJSills, MA Benzofuro[2,3-c]pyridin-6-ols: synthesis, affinity for opioid-receptor subtypes, and antinociceptive activity. J Med Chem32:2221-6 (1989) Sigma non-opioid intracellular receptor 1
Name:Sigma non-opioid intracellular receptor 1
Type:Enzyme Catalytic Domain
Mol. Mass.:25246.51
Organism:Mus musculus (Mouse)
Description:O55242
Residue:223
BDBM50017232
NameBDBM50017232
Synonyms:3-Cyclopropylmethyl-5-ethyl-8-hydroxy-11-methyl-3,4,5,6-tetrahydro-2H-2,6-methano-benzo[d]azocin-1-one | CHEMBL71301
TypeSmall organic molecule
Emp. Form.C19H25NO2
Mol. Mass.299.4073
SMILESCCC1CN(CC2CC2)C2C(C)C1c1cc(O)ccc1C2=O