Reaction Details
Target5-hydroxytryptamine receptor 3A/3B
LigandBDBM50108392
Substrate/Competitorn/a
Meas. Tech.ChEMBL_3142 (CHEMBL617984)
Ki 2.7±n/a nM
Citation Nagel, AARosen, TRizzi, JDaffeh, JGuarino, KNowakowski, JVincent, LAHeym, JMcLean, SSeeger, T Aromatic thiazole derivatives: structurally novel and selective serotonin-3 receptor antagonists. J Med Chem33:13-6 (1990) 5-hydroxytryptamine receptor 3A/3B
Name:5-hydroxytryptamine receptor 3A/3B
Type:n/a
Mol. Mass.:n/a
Description:ASSAY_ID of EBI is 2974
Components:This complex has 2 components.
Component 1
Name:5-hydroxytryptamine receptor 3B
Synonyms:5HT3B_RAT Serotonin (5-HT) receptor
Type:PROTEIN
Mol. Mass.:50328.78
Organism:Rattus norvegicus
Description:EBI_11885
Residue:437
Component 2
Name:5-hydroxytryptamine receptor 3A
Synonyms:5-HT3 5HT3A_RAT Htr3 Serotonin (5-HT) receptor | Zacopride site-R
Type:Enzyme Catalytic Domain
Mol. Mass.:55428.70
Organism:RAT
Description:5-HT3 HTR3A RAT::P35563
Residue:483
BDBM50108392
NameBDBM50108392
Synonyms:(3-ENDO)-8-METHYL-8-AZABICYCLO[3.2.1]OCT-3-YL 1H-INDOLE-3-CARBOXYLATE | CHEMBL56564
TypeSmall organic molecule
Emp. Form.C17H20N2O2
Mol. Mass.284.3529
SMILESCN1[C@H]2CC[C@@H]1C[C@@H](C2)OC(=O)c1c[nH]c2ccccc12