Reaction Details
TargetAmine oxidase [flavin-containing] A
LigandBDBM50014648
Substrate/Competitorn/a
Meas. Tech.ChEMBL_122785 (CHEMBL730893)
Ki 27000±n/a nM
Citation Bembenek, MEAbell, CWChrisey, LARozwadowska, MDGessner, WBrossi, A Inhibition of monoamine oxidases A and B by simple isoquinoline alkaloids: racemic and optically active 1,2,3,4-tetrahydro-, 3,4-dihydro-, and fully aromatic isoquinolines. J Med Chem33:147-52 (1990) Amine oxidase [flavin-containing] A
Name:Amine oxidase [flavin-containing] A
Type:Protein
Mol. Mass.:59689.53
Organism:Homo sapiens (Human)
Description:P21397
Residue:527
BDBM50014648
NameBDBM50014648
Synonyms:6,7-Dimethoxy-2-methyl-1,2,3,4-tetrahydro-isoquinoline; hydrobromide (o-methylcorypalline) | CHEMBL555787
TypeSmall organic molecule
Emp. Form.C12H17NO2
Mol. Mass.207.2689
SMILESCOc1cc2CCN(C)Cc2cc1OC