Reaction Details
TargetThymidine kinase, cytosolic
LigandBDBM50002692
Substrate/Competitorn/a
Meas. Tech.ChEMBL_208195 (CHEMBL819098)
Ki 2900±n/a nM
Citation Palomino, EMeltsner, BRKessel, DHorwitz, JP Synthesis and in vitro evaluation of some modified 4-thiopyrimidine nucleosides for prevention or reversal of AIDS-associated neurological disorders. J Med Chem33:258-63 (1990) Thymidine kinase, cytosolic
Name:Thymidine kinase, cytosolic
Type:PROTEIN
Mol. Mass.:25476.50
Organism:Homo sapiens (Human)
Description:ChEMBL_1333884
Residue:234
BDBM50002692
NameBDBM50002692
Synonyms:(AZT) 1-(4-Azido-5-hydroxymethyl-tetrahydro-furan-2-yl)-5-methyl-1H-pyrimidine-2,4-dione 1-((2R,4R,5S)-4-azido-5-(hydroxymethyl)tetrahydrofuran-2-yl)-5-methylpyrimidine-2,4(1H,3H)-dione 1-((2R,4S,5S)-4-Azido-5-hydroxymethyl-tetrahydro-furan-2-yl)-5-methyl-1H-pyrimidine-2,4-dione 1-((2R,4S,5S)-4-azido-5-(hydroxymethyl)tetrahydrofuran-2-yl)-5-methylpyrimidine-2,4(1H,3H)-dione 1-((2S,4R,5R)-4-Azido-5-hydroxymethyl-tetrahydro-furan-2-yl)-5-methyl-1H-pyrimidine-2,4-dione 1-(4-Azido-5-hydroxymethyl-tetrahydro-furan-2-yl)-5-methyl-1H-pyrimidine-2,4-dione (AZT) 1-(4-Azido-5-hydroxymethyl-tetrahydro-furan-2-yl)-5-methyl-1H-pyrimidine-2,4-dione (N3ddThd) 1-(4-Azido-5-hydroxymethyl-tetrahydro-furan-2-yl)-5-methyl-1H-pyrimidine-2,4-dione(3'-azido-2',3'-dideoxythymidine) 1-(4-Azido-5-hydroxymethyl-tetrahydro-furan-2-yl)-5-methyl-1H-pyrimidine-2,4-dione(Zidovudine, AZT) 3'-Azido-3'-deoxy-thymidine 3'-azido-2',3'-dideoxythymidine 3'azido-2'3'-dideoxythymidine 4-(4-Azido-5-hydroxy-tetrahydro-furan-2-yl)-5-methyl-3H-pyrazine-2,6-dione BW-A-509U CHEMBL129 US10071110, Compound AZT ZIDOVUDINE zidovudin | zudovidine
TypeSmall organic molecule
Emp. Form.C10H13N5O4
Mol. Mass.267.2413
SMILESCc1cn([C@H]2C[C@H](N=[N+]=[N-])[C@@H](CO)O2)c(=O)[nH]c1=O