Reaction Details
TargetThymidine kinase, cytosolic
LigandBDBM50367920
Substrate/Competitorn/a
Meas. Tech.ChEMBL_208196 (CHEMBL819099)
Ki 54000±n/a nM
Citation Palomino, EMeltsner, BRKessel, DHorwitz, JP Synthesis and in vitro evaluation of some modified 4-thiopyrimidine nucleosides for prevention or reversal of AIDS-associated neurological disorders. J Med Chem33:258-63 (1990) Thymidine kinase, cytosolic
Name:Thymidine kinase, cytosolic
Type:PROTEIN
Mol. Mass.:25476.50
Organism:Homo sapiens (Human)
Description:ChEMBL_1333884
Residue:234
BDBM50367920
NameBDBM50367920
Synonyms:CHEMBL1790742
TypeSmall organic molecule
Emp. Form.C10H13N5O3S
Mol. Mass.283.307
SMILESCc1cn([C@H]2C[C@H](N=[N+]=[N-])[C@@H](CO)O2)c(=O)[nH]c1=S