Reaction Details
TargetKappa-type opioid receptor
LigandBDBM50013147
Substrate/Competitorn/a
Meas. Tech.ChEBML_146388
Ki 16±n/a nM
Citation Halfpenny, PRHorwell, DCHughes, JHunter, JCRees, DC Highly selective kappa-opioid analgesics. 3. Synthesis and structure-activity relationships of novel N-[2-(1-pyrrolidinyl)-4- or -5-substituted-cyclohexyl]arylacetamide derivatives. J Med Chem33:286-91 (1990) Kappa-type opioid receptor
Name:Kappa-type opioid receptor
Type:G Protein-Coupled Receptor (GPCR)
Mol. Mass.:42744.99
Organism:Cavia porcellus (domestic guinea pig)
Description:P41144
Residue:380
BDBM50013147
NameBDBM50013147
Synonyms:2-Benzo[b]thiophen-4-yl-N-(4,5-dimethoxy-2-pyrrolidin-1-yl-cyclohexyl)-N-methyl-acetamide; hydrochloride | CHEMBL544321
TypeSmall organic molecule
Emp. Form.C23H32N2O3S
Mol. Mass.416.577
SMILESCO[C@H]1CC([C@H](C[C@H]1OC)N1CCCC1)N(C)C(=O)Cc1cccc2sccc12