Reaction Details
TargetRenin
LigandBDBM50012952
Substrate/Competitorn/a
Meas. Tech.ChEMBL_195969 (CHEMBL807518)
IC50 270±n/a nM
Citation Iizuka, KKamijo, THarada, HAkahane, KKubota, TUmeyama, HIshida, TKiso, Y Orally potent human renin inhibitors derived from angiotensinogen transition state: design, synthesis, and mode of interaction. J Med Chem33:2707-14 (1990) Renin
Name:Renin
Type:Enzyme
Mol. Mass.:45058.99
Organism:Homo sapiens (Human)
Description:n/a
Residue:406
BDBM50012952
NameBDBM50012952
Synonyms:2-Hydroxy-3-[3-(1H-imidazol-4-yl)-2-(4-morpholin-4-yl-2-naphthalen-1-ylmethyl-4-oxo-butyrylamino)-propionylamino]-4-phenyl-butyric acid isopropyl ester | CHEMBL330093
TypeSmall organic molecule
Emp. Form.C38H45N5O7
Mol. Mass.683.7932
SMILESCC(C)OC(=O)C(O)[C@@H](Cc1ccccc1)NC(=O)[C@H](Cc1cnc[nH]1)NC(=O)[C@@H](CC(=O)N1CCOCC1)Cc1cccc2ccccc12