Reaction Details
Target5-hydroxytryptamine receptor 3A
LigandBDBM50000492
Substrate/Competitorn/a
Meas. Tech.ChEBML_3470
Ki 0.700000±n/a nM
Citation Rizzi, JPNagel, AARosen, TMcLean, SSeeger, T An initial three-component pharmacophore for specific serotonin-3 receptor ligands. J Med Chem33:2721-5 (1990) 5-hydroxytryptamine receptor 3A
Name:5-hydroxytryptamine receptor 3A
Type:Protein
Mol. Mass.:55283.27
Organism:Homo sapiens (Human)
Description:P46098
Residue:478
BDBM50000492
NameBDBM50000492
Synonyms:(zacopride)4-Amino-N-(1-aza-bicyclo[2.2.2]oct-3-yl)-5-chloro-2-methoxy-benzamide 4-Amino-N-(1-aza-bicyclo[2.2.2]oct-3-yl)-5-chloro-2-methoxy-benzamide (Zacopride) CHEMBL18041 ZACOPRIDE ZACOPRIDE,RS | ZACOPRIDE,S
TypeSmall organic molecule
Emp. Form.C15H20ClN3O2
Mol. Mass.309.791
SMILESCOc1cc(N)c(Cl)cc1C(=O)NC1CN2CCC1CC2