Reaction Details
TargetSodium-dependent noradrenaline transporter
LigandBDBM50014244
Substrate/Competitorn/a
Meas. Tech.ChEBML_131452
Ki 12±n/a nM
Citation Maryanoff, BEVaught, JLShank, RPMcComsey, DFCostanzo, MJNortey, SO Pyrroloisoquinoline antidepressants. 3. A focus on serotonin. J Med Chem33:2793-7 (1990) Sodium-dependent noradrenaline transporter
Name:Sodium-dependent noradrenaline transporter
Type:Enzyme Catalytic Domain
Mol. Mass.:69260.85
Organism:MOUSE
Description:Norepinephrine transporter 0 MOUSE::O55192
Residue:617
BDBM50014244
NameBDBM50014244
Synonyms:10-Methyl-6-(4-methylsulfanyl-phenyl)-1,2,3,5,6,10b-hexahydro-pyrrolo[2,1-a]isoquinoline; hydrobromide | CHEMBL555462
TypeSmall organic molecule
Emp. Form.C20H23NS
Mol. Mass.309.468
SMILESCSc1ccc(cc1)C1CN2CCCC2c2c(C)cccc12