Reaction Details
TargetSodium-dependent dopamine transporter
LigandBDBM50014237
Substrate/Competitorn/a
Meas. Tech.ChEMBL_131451 (CHEMBL740206)
Ki 36.8±n/a nM
Citation Maryanoff, BEVaught, JLShank, RPMcComsey, DFCostanzo, MJNortey, SO Pyrroloisoquinoline antidepressants. 3. A focus on serotonin. J Med Chem33:2793-7 (1990) Sodium-dependent dopamine transporter
Name:Sodium-dependent dopamine transporter
Type:Enzyme Catalytic Domain
Mol. Mass.:68809.06
Organism:MOUSE
Description:Dopamine Transporter SLC6A3 MOUSE::Q61327
Residue:619
BDBM50014237
NameBDBM50014237
Synonyms:6-(4-Methylsulfanyl-phenyl)-1,2,3,5,6,10b-hexahydro-pyrrolo[2,1-a]isoquinoline | CHEMBL327790
TypeSmall organic molecule
Emp. Form.C19H21NS
Mol. Mass.295.442
SMILESCSc1ccc(cc1)C1CN2CCC[C@@H]2c2ccccc12